{"text_format":"1","workbook":"xlsx","n_sheets":4,"sheets":["Menu","IndicesBancoCentral","Resultado","FonteDados"],"not_rendered":{"charts":0,"images":0,"macros":1,"external_links":0,"defined_names":6,"comments":0,"pivot_tables":0},"unopened":[],"bounds":{"document_bytes":16777216,"sheet_cells":100000,"rows_first":2000,"rows_last":500,"rows_between":2000,"halvings":0,"cell_chars":16384,"cell_head_chars":4096},"cells_cut":0,"cells_raw":0,"read":"whole","date_system":"1900"}

{"sheet":"Menu","index":0,"n_rows":7,"n_cols":3,"rows_kept":7,"cut":false,"hidden":false,"merged":[]}
["Data Inicial:","2022-01-01"]
["Data Final:","2022-12-31"]
["Nome do índice:","CDI","<-- DropDown List"]
["Código do índice no BC:",{"$f":"IFERROR(VLOOKUP($B$3,IndicesBancoCentral!A:E,2,FALSE),\"Fator Não Cadastrado\")","v":12},"--> preenchimento automático"]
["Base do índice:",{"$f":"IFERROR(VLOOKUP($B$3,IndicesBancoCentral!A:E,3,FALSE),\"Fator Não Cadastrado\")","v":"% a.d."},"--> preenchimento automático"]
["Fator de divisão:",{"$f":"IFERROR(VLOOKUP($B$3,IndicesBancoCentral!A:E,4,FALSE),\"Fator Não Cadastrado\")","v":100},"--> preenchimento automático"]
["Acumular índice:",{"$f":"IFERROR(VLOOKUP($B$3,IndicesBancoCentral!A:E,5,FALSE),\"Fator Não Cadastrado\")","v":"S"},"--> preenchimento automático"]

{"sheet":"IndicesBancoCentral","index":1,"n_rows":8,"n_cols":5,"rows_kept":8,"cut":false,"hidden":false,"merged":[]}
["Fator","Número Fator BC","Unidade","Divide Fator","Acumula Fator"]
["CDI",12,"% a.d.",100,"S"]
["CDI Anualizado",4389,"% a.a.",1,"N"]
["IPCA",433,"% a.m.",1,"N"]
["SELIC",11,"% a.d.",100,"S"]
["SELIC Anualizada",432,"% a.a.",1,"N"]
["IGPM",189,"% a.m.",1,"N"]
["Taxa referencial (TR)",226,"% a.m.",1,"N"]

{"sheet":"Resultado","index":2,"n_rows":0,"n_cols":0,"rows_kept":0,"cut":false,"hidden":false,"merged":[]}

{"sheet":"FonteDados","index":3,"n_rows":3,"n_cols":1,"rows_kept":3,"cut":false,"hidden":false,"merged":[]}
["Banco Central do Brasil"]
["Time Series Management System"]
["https://www3.bcb.gov.br/sgspub/localizarseries/localizarSeries.do?method=prepararTelaLocalizarSeries"]